BDBM247477 US9453023, 36
SMILES C[C@H]1CCCN1C1CC[C@@H](C1)c1ccc(NC(=O)c2ccc(OC(F)(F)F)cc2)cc1
InChI Key InChIKey=KKJPFWLMCDUHRB-ZRAKIVDLSA-N
Data  1 KI
  Tab Delimited (TSV)   2D SDfile   Computed 3D by Vconf -m prep SDfile
Find this compound or compounds like it in BindingDB:
Activity Spreadsheet -- Enzyme Inhibition Constant Data from BindingDB
Found 1 hit for monomerid = 247477
TargetHistamine receptor H3(Macaca mulatta (Rhesus macaque))
Sanofi
US Patent
LigandPNGBDBM247477(US9453023, 36)
Affinity DataKi:  48.5nM. Assay description: Rhesus H3 radioligand binding assay was performed using rhesus H3 receptor membranes (prepared as described above), [3H]-Methylhistamine (Perkin Elme...
Ligand InfoPC cidPC sid
In DepthDetails US Patent