BDBM247611 US9434719, 213::US9434719, 213 as TFA salt
SMILES C[C@@H](O)C1COC(=O)N1c1cc(Cl)nc(N[C@@H](C)c2cc(on2)-c2ccc(Cl)cc2)n1
InChI Key InChIKey=IPBYIAIAZKELOY-FEBOZLGHSA-N
Data  4 IC50
  Tab Delimited (TSV)   2D SDfile   Computed 3D by Vconf -m prep SDfile
Find this compound or compounds like it in BindingDB:
Activity Spreadsheet -- Enzyme Inhibition Constant Data from BindingDB
Found 4 hits for monomerid = 247611
TargetIsocitrate dehydrogenase [NADP] cytoplasmic(Homo sapiens (Human))
Novartis
US Patent
LigandPNGBDBM247611(US9434719, 213 | US9434719, 213 as TFA salt)
Affinity DataIC50:  11nMpH: 7.5 T: 2°C. Assay description: The IDH1 (R132H) mutant catalyzes the reduced form of NADP+ (NADPH) and α-ketoglutarate (α-KG) to form nicotinamide adenine dinucleotide ph...
Ligand InfoPC cidPC sid
In DepthDetails US Patent
TargetIsocitrate dehydrogenase [NADP] cytoplasmic(Homo sapiens (Human))
Novartis
US Patent
LigandPNGBDBM247611(US9434719, 213 | US9434719, 213 as TFA salt)
Affinity DataIC50:  18nMpH: 7.4 T: 2°C. Assay description: The biochemical reactions were performed at room temperature in 384-well Greiner flat-bottom plates (Costar, Cat. No. 781201) using a final reaction ...
Ligand InfoPC cidPC sid
In DepthDetails US Patent
TargetIsocitrate dehydrogenase [NADP] cytoplasmic(Homo sapiens (Human))
Novartis
US Patent
LigandPNGBDBM247611(US9434719, 213 | US9434719, 213 as TFA salt)
Affinity DataIC50: <22.9nMpH: 7.4 T: 2°C. Assay description: The biochemical reactions were performed at room temperature in 384-well Greiner flat-bottom plates (Costar, Cat. No. 781201) using a final reaction ...
Ligand InfoPC cidPC sid
In DepthDetails US Patent
TargetIsocitrate dehydrogenase [NADP] cytoplasmic(Homo sapiens (Human))
Novartis
US Patent
LigandPNGBDBM247611(US9434719, 213 | US9434719, 213 as TFA salt)
Affinity DataIC50:  19nMpH: 7.5 T: 2°C. Assay description: The IDH1 (R132H) mutant catalyzes the reduced form of NADP+ (NADPH) and α-ketoglutarate (α-KG) to form nicotinamide adenine dinucleotide ph...
Ligand InfoPC cidPC sid
In DepthDetails US Patent