BDBM247822 US10112931, Example 429::US9434719, 429::US9688672, Example 429
SMILES C[C@H](Nc1ncc(F)c(n1)N1[C@@H](CF)COC1=O)c1cn(cn1)-c1ccc(Cl)cc1
InChI Key InChIKey=RRSNVVPVDMADPO-FZMZJTMJSA-N
Data  4 IC50
  Tab Delimited (TSV)   2D SDfile   Computed 3D by Vconf -m prep SDfile
Find this compound or compounds like it in BindingDB:
Activity Spreadsheet -- Enzyme Inhibition Constant Data from BindingDB
Found 4 hits for monomerid = 247822
TargetIsocitrate dehydrogenase [NADP] cytoplasmic(Homo sapiens (Human))
Novartis
US Patent
LigandPNGBDBM247822(US10112931, Example 429 | US9434719, 429 | US96886...)
Affinity DataIC50: <16nMpH: 7.5 T: 2°C. Assay description: The IDH1 (R132H) mutant catalyzes the reduced form of NADP+ (NADPH) and α-ketoglutarate (α-KG) to form nicotinamide adenine dinucleotide ph...
Ligand InfoPC cidPC sid
In DepthDetails US Patent
TargetIsocitrate dehydrogenase [NADP] cytoplasmic(Homo sapiens (Human))
Novartis
US Patent
LigandPNGBDBM247822(US10112931, Example 429 | US9434719, 429 | US96886...)
Affinity DataIC50:  24nM. Assay description: Inhibition of IDH1 R132H mutant (unknown origin) expressed in HCT116 cells assessed as reduction in 2-HG levels after 48 hrs by LC-MS/MS analysis
Ligand InfoPC cidPC sid
In DepthDetails ArticlePubMed
TargetIsocitrate dehydrogenase [NADP] cytoplasmic [R132H](Homo sapiens (Human))
Novartis
US Patent
LigandPNGBDBM247822(US10112931, Example 429 | US9434719, 429 | US96886...)
Affinity DataIC50: <16nMpH: 7.5 T: 2°C. Assay description: The IDH1 (R132H) mutant catalyzes the reduced form of NADP+ (NADPH) and α-ketoglutarate (α-KG) to form nicotinamide adenine dinucleotide ph...
Ligand InfoPC cidPC sid
In DepthDetails US Patent
TargetIsocitrate dehydrogenase [NADP] cytoplasmic [R132H](Homo sapiens (Human))
Novartis
US Patent
LigandPNGBDBM247822(US10112931, Example 429 | US9434719, 429 | US96886...)
Affinity DataIC50: <16nMpH: 7.5 T: 2°C. Assay description: The IDH1 (R132H) mutant catalyzes the reduced form of NADP+(NADPH) and α-ketoglutarate (α-KG) to form nicotinamide adenine dinucleotide pho...
Ligand InfoPC cidPC sid
In DepthDetails US Patent