BDBM247933 US9434719, 192
SMILES C[C@@H](O)C1COC(=O)N1c1nc(NC(C)c2ncc(cn2)-c2ccc(Cl)c(Cl)c2)ncc1F
InChI Key InChIKey=QGEKZNPRAWNBRC-VVHFOWEKSA-N
Data  1 IC50
  Tab Delimited (TSV)   2D SDfile   Computed 3D by Vconf -m prep SDfile
Find this compound or compounds like it in BindingDB:
Activity Spreadsheet -- Enzyme Inhibition Constant Data from BindingDB
Found 1 hit for monomerid = 247933
TargetIsocitrate dehydrogenase [NADP] cytoplasmic(Homo sapiens (Human))
Novartis
US Patent
LigandPNGBDBM247933(US9434719, 192)
Affinity DataIC50:  10nMpH: 7.4 T: 2°C. Assay description: The biochemical reactions were performed at room temperature in 384-well Greiner flat-bottom plates (Costar, Cat. No. 781201) using a final reaction ...
Ligand InfoPC cidPC sid
In DepthDetails US Patent