BDBM248054 5-(4-(3-cyclopentenylbenzyl)piperazin-1-yl)-1H-benzo[d]imidazol-2(3H)-one (6e)
SMILES O=c1[nH]c2ccc(cc2[nH]1)N1CCN(Cc2cccc(c2)C2=CCCC2)CC1
InChI Key InChIKey=ZPRJWVIVUPFMTK-UHFFFAOYSA-N
Data  2 KI
  Tab Delimited (TSV)   2D SDfile   Computed 3D by Vconf -m prep SDfile
Find this compound or compounds like it in BindingDB:
Activity Spreadsheet -- Enzyme Inhibition Constant Data from BindingDB
Found 2 hits for monomerid = 248054
Target5-hydroxytryptamine receptor 1A(Homo sapiens (Human))
King Fahd University Of Petroleum & Minerals
LigandPNGBDBM248054(5-(4-(3-cyclopentenylbenzyl)piperazin-1-yl)-1H-ben...)
Affinity DataKi:  3.10nM ΔG°:  -12.1kcal/molepH: 7.4 T: 2°C. Assay description: Human-cloned 5-HT1A serotonin receptors stably expressed in HEK293-EBNA cells (Perkin-Elmer, Waltham, MA) were radiolabeled with 1.0nM [3H]-8-OH-DPAT...
Ligand InfoPC cidPC sid
In DepthDetails ArticlePubMed
TargetD(2) dopamine receptor(Homo sapiens (Human))
King Fahd University Of Petroleum & Minerals
LigandPNGBDBM248054(5-(4-(3-cyclopentenylbenzyl)piperazin-1-yl)-1H-ben...)
Affinity DataKi:  10.4nM ΔG°:  -10.9kcal/molepH: 7.4 T: 2°C. Assay description: Human-cloned dopamine D2L receptors stably expressed in C6 rat glioma cells (kindly donated by Professor Roberto Maggio, Università di L'Aquil...
Ligand InfoPC cidPC sid
In DepthDetails ArticlePubMed