BDBM248064 SMY-610
SMILES CCCCCCCCCCCCC\C=C\[C@@H](Oc1cccc(n1)-c1ccccn1)[C@H](COCc1cccc(n1)-c1ccccn1)NC(=O)CCCCC
InChI Key InChIKey=MLMSBFQFNVRCKP-BQWZWJGLSA-N
Data  1 IC50
  Tab Delimited (TSV)   2D SDfile   Computed 3D by Vconf -m prep SDfile
Find this compound or compounds like it in BindingDB:
Activity Spreadsheet -- Enzyme Inhibition Constant Data from BindingDB
Found 1 hit for monomerid = 248064
TargetSphingomyelinase C(Bacillus cereus)
Tokushima Bunri University
LigandPNGBDBM248064(SMY-610)
Affinity DataIC50:  3.30E+3nMpH: 7.5 T: 2°C. Assay description: Briefly, Bc-SMase (50 ng/ml) was treated at 37 °C for 60 min with various compounds that were solubilized in dimethylacetoamide. The reaction mix...
Ligand InfoPC cidPC sid
In DepthDetails ArticlePubMed