BDBM248076 4-hydroxy-3-{[4-(4-methyl-1,1-dioxido-3-oxoisothiazolidin-2-yl)benzoyl]amino}benzoic acid (26)
SMILES CC1CS(=O)(=O)N(C1=O)c1ccc(cc1)C(=O)Nc1cc(ccc1O)C(O)=O
InChI Key InChIKey=FBWCEJBBERCJRL-UHFFFAOYSA-N
Data  1 IC50
  Tab Delimited (TSV)   2D SDfile   Computed 3D by Vconf -m prep SDfile
Find this compound or compounds like it in BindingDB:
Activity Spreadsheet -- Enzyme Inhibition Constant Data from BindingDB
Found 1 hit for monomerid = 248076
TargetCasein kinase II subunit alpha/beta(Homo sapiens (Human))
Nas Of Ukraine
LigandPNGBDBM248076(4-hydroxy-3-{[4-(4-methyl-1,1-dioxido-3-oxoisothia...)
Affinity DataIC50:  1.60E+4nMpH: 7.5 T: 2°C. Assay description: Each test was performed twice in a total reaction volume of 30 μL, containing 6 μg of peptide substrate RRRDDDSDDD (New England Biolabs (UK) Lt...
In DepthDetails ArticlePubMed