BDBM248099 IMPDH II inhibitor, 16
SMILES CCC(CC#N)OC(=O)N[C@@H](C)c1cccc(NC(=O)Nc2ccc(C3=CCOCC3)c(OC)c2)c1
InChI Key InChIKey=CPNLLHNHFNYOII-XNUZUHMRSA-N
Data  1 IC50
  Tab Delimited (TSV)   2D SDfile   Computed 3D by Vconf -m prep SDfile
Find this compound or compounds like it in BindingDB:
Activity Spreadsheet -- Enzyme Inhibition Constant Data from BindingDB
Found 1 hit for monomerid = 248099
TargetInosine-5'-monophosphate dehydrogenase 2(Homo sapiens (Human))
Nycomed
LigandPNGBDBM248099(IMPDH II inhibitor, 16)
Affinity DataIC50:  3.50E+3nMpH: 8.0 T: 2°C. Assay description: The assay was performed in a 100 μL final volume in 96-well UV plates (Costar, 3635) with a reaction buffer composed of 50 mM Tris-HCl (pH 8.0), 1...
Ligand InfoPC cidPC sid
In DepthDetails ArticlePubMed