BDBM248145 CA standard inhibitor, 4
SMILES CCN(CC)Cc1cc(ccc1O)C(=O)\C=C\c1cccnc1
InChI Key InChIKey=DAHPWSPSGKMZRR-VQHVLOKHSA-N
Data  3 KI
  Tab Delimited (TSV)   2D SDfile   Computed 3D by Vconf -m prep SDfile
Find this compound or compounds like it in BindingDB:
Activity Spreadsheet -- Enzyme Inhibition Constant Data from BindingDB
Found 3 hits for monomerid = 248145
TargetCarbonic anhydrase 1(Homo sapiens (Human))
Ataturk University
LigandPNGBDBM248145(CA standard inhibitor, 4)
Affinity DataKi:  7.76E+3nM ΔG°:  -6.97kcal/molepH: 7.4 T: 2°C. Assay description: An Applied Photophysics stopped-flow instrument has been used for assaying the CA catalyzed CO2 hydration activity [Khalifah et al., J. Biol. Chem., ...
Ligand InfoPC cidPC sid
In DepthDetails ArticlePubMed
TargetCarbonic anhydrase 2(Homo sapiens (Human))
Ataturk University
LigandPNGBDBM248145(CA standard inhibitor, 4)
Affinity DataKi:  2.69E+4nM ΔG°:  -6.23kcal/molepH: 7.4 T: 2°C. Assay description: An Applied Photophysics stopped-flow instrument has been used for assaying the CA catalyzed CO2 hydration activity [Khalifah et al., J. Biol. Chem., ...
Ligand InfoPC cidPC sid
In DepthDetails ArticlePubMed
TargetCarbonic anhydrase(Saccharomyces cerevisiae (Baker's yeast))
Ataturk University
LigandPNGBDBM248145(CA standard inhibitor, 4)
Affinity DataKi:  7.71E+4nM ΔG°:  -5.61kcal/molepH: 7.4 T: 2°C. Assay description: An Applied Photophysics stopped-flow instrument has been used for assaying the CA catalyzed CO2 hydration activity [Khalifah et al., J. Biol. Chem., ...
Ligand InfoPC cidPC sid
In DepthDetails ArticlePubMed