BDBM248159 Cathepsin S inhibitor alpha-ketoamide, 6p
SMILES CCOC(=O)CNC(=O)C(=O)C(COCc1ccccc1)NC(=O)C(CC1CCCCC1)NC(=O)c1ccc(C(=O)OC)c(N)c1
InChI Key InChIKey=GAFMFBMFEMXIHQ-UHFFFAOYSA-N
Data  1 IC50
  Tab Delimited (TSV)   2D SDfile   Computed 3D by Vconf -m prep SDfile
Find this compound or compounds like it in BindingDB:
Activity Spreadsheet -- Enzyme Inhibition Constant Data from BindingDB
Found 1 hit for monomerid = 248159
TargetCathepsin S(Homo sapiens (Human))
National Tsing Hua University
LigandPNGBDBM248159(Cathepsin S inhibitor alpha-ketoamide, 6p)
Affinity DataIC50:  5.80nMpH: 6.5 T: 2°C. Assay description: A microplate-based screening procedure was used to study the effect of inhibition of re-Cat S, re-Cat L and re-Cat K on several compounds. The assays...
Ligand InfoPC cidPC sid
In DepthDetails ArticlePubMed