BDBM248166 Carvacrol derivative, 9
SMILES Cc1ccccc1O
InChI Key InChIKey=QWVGKYWNOKOFNN-UHFFFAOYSA-N
Data  1 IC50
  Tab Delimited (TSV)   2D SDfile   Computed 3D by Vconf -m prep SDfile
Find this compound or compounds like it in BindingDB:
Activity Spreadsheet -- Enzyme Inhibition Constant Data from BindingDB
Found 1 hit for monomerid = 248166
TargetSecreted chorismate mutase(Mycobacterium tuberculosis H37Rv)
Birla Institute Of Technology
LigandPNGBDBM248166(Carvacrol derivative, 9)
Affinity DataIC50:  2.31E+4nMpH: 7.5 T: 2°C. Assay description: Reaction volumes of 0.4 mL of chorismate (typically, 1 mM) in 50 mM Tris-HCl (pH 7.5), 0.5 mM EDTA, 0.1 mg/mL bovine serum albumin, and 10 mM β-...
In DepthDetails ArticlePubMed