BDBM24819 (methylsulfanyl)-N-(naphthalen-2-ylmethyl)carbothioamide::Brassinin derivative, 7
SMILES CSC(=S)NCc1ccc2ccccc2c1
InChI Key InChIKey=QZIRYJGHKRLVRO-UHFFFAOYSA-N
Data  1 KI
  Tab Delimited (TSV)   2D SDfile   Computed 3D by Vconf -m prep SDfile
Find this compound or compounds like it in BindingDB:
Activity Spreadsheet -- Enzyme Inhibition Constant Data from BindingDB
Found 1 hit for monomerid = 24819
TargetIndoleamine 2,3-dioxygenase 1(Homo sapiens (Human))
Bryn Mawr College
LigandPNGBDBM24819((methylsulfanyl)-N-(naphthalen-2-ylmethyl)carbothi...)
Affinity DataKi:  4.76E+4nM ΔG°:  -6.13kcal/molepH: 6.5 T: 2°C. Assay description: The IC50 inhibition assays were performed in a 96-well microtiter plate format using purified recombinant IDO, which was added to the substrate, L-tr...
In DepthDetails ArticlePubMed