BDBM24844 5-{7H-pyrrolo[2,3-d]pyrimidin-4-yl}-3H,4H,5H,6H,7H-imidazo[4,5-c]pyridine::pyrrolopyrimidine, 8a
SMILES C1Cc2nc[nH]c2CN1c1ncnc2[nH]ccc12
InChI Key InChIKey=RNQMCOZOSONNRJ-UHFFFAOYSA-N
Data  1 IC50
  Tab Delimited (TSV)   2D SDfile   Computed 3D by Vconf -m prep SDfile
Find this compound or compounds like it in BindingDB:
Activity Spreadsheet -- Enzyme Inhibition Constant Data from BindingDB
Found 1 hit for monomerid = 24844
TargetRAC-alpha serine/threonine-protein kinase(Homo sapiens (Human))
Pfizer
LigandPNGBDBM24844(5-{7H-pyrrolo[2,3-d]pyrimidin-4-yl}-3H,4H,5H,6H,7H...)
Affinity DataIC50:  294nMpH: 7.5 T: 2°C. Assay description: A fluorescence polarization IMAP type assay is used. After a 90 min incubation of reaction mixtures containing enzyme, substrate, and inhibitor, IMAP...
In DepthDetails ArticlePubMed