BDBM24847 5-chloro-1-{7H-pyrrolo[2,3-d]pyrimidin-4-yl}-1,2-dihydrospiro[indole-3,4'-piperidine]::pyrrolopyrimidine, 13b
SMILES Clc1ccc2N(CC3(CCNCC3)c2c1)c1ncnc2[nH]ccc12
InChI Key InChIKey=SYJAQTIUQWZRLK-UHFFFAOYSA-N
Data  1 IC50
  Tab Delimited (TSV)   2D SDfile   Computed 3D by Vconf -m prep SDfile
Find this compound or compounds like it in BindingDB:
Activity Spreadsheet -- Enzyme Inhibition Constant Data from BindingDB
Found 1 hit for monomerid = 24847
TargetRAC-alpha serine/threonine-protein kinase(Homo sapiens (Human))
Pfizer
LigandPNGBDBM24847(5-chloro-1-{7H-pyrrolo[2,3-d]pyrimidin-4-yl}-1,2-d...)
Affinity DataIC50:  4.80nMpH: 7.5 T: 2°C. Assay description: A fluorescence polarization IMAP type assay is used. After a 90 min incubation of reaction mixtures containing enzyme, substrate, and inhibitor, IMAP...
In DepthDetails ArticlePubMed