BDBM24853 1-{5-methyl-7H-pyrrolo[2,3-d]pyrimidin-4-yl}-1,2-dihydrospiro[indole-3,4'-piperidine]::pyrrolopyrimidine, 13h
SMILES Cc1c[nH]c2ncnc(N3CC4(CCNCC4)c4ccccc34)c12
InChI Key InChIKey=ARIHYXITNVJHJL-UHFFFAOYSA-N
Data  1 IC50
  Tab Delimited (TSV)   2D SDfile   Computed 3D by Vconf -m prep SDfile
Find this compound or compounds like it in BindingDB:
Activity Spreadsheet -- Enzyme Inhibition Constant Data from BindingDB
Found 1 hit for monomerid = 24853
TargetRAC-alpha serine/threonine-protein kinase(Homo sapiens (Human))
Pfizer
LigandPNGBDBM24853(1-{5-methyl-7H-pyrrolo[2,3-d]pyrimidin-4-yl}-1,2-d...)
Affinity DataIC50:  4.80nMpH: 7.5 T: 2°C. Assay description: A fluorescence polarization IMAP type assay is used. After a 90 min incubation of reaction mixtures containing enzyme, substrate, and inhibitor, IMAP...
In DepthDetails ArticlePubMed