BDBM24885 2,3,5-trisubstituted pyridine, 10a::5-{5-phenyl-6-[4-({4-[5-(pyridin-4-yl)-1H-pyrazol-3-yl]piperidin-1-yl}methyl)phenyl]pyridin-3-yl}-1,3,4-thiadiazol-2-amine
SMILES Nc1nnc(s1)-c1cnc(-c2ccc(CN3CCC(CC3)c3cc(n[nH]3)-c3ccncc3)cc2)c(c1)-c1ccccc1
InChI Key InChIKey=BHRZESZXIYBZTH-UHFFFAOYSA-N
Data  2 IC50
  Tab Delimited (TSV)   2D SDfile   Computed 3D by Vconf -m prep SDfile
Find this compound or compounds like it in BindingDB:
Activity Spreadsheet -- Enzyme Inhibition Constant Data from BindingDB
Found 2 hits for monomerid = 24885
TargetRAC-beta serine/threonine-protein kinase(Homo sapiens (Human))
Merck Research Laboratories
LigandPNGBDBM24885(2,3,5-trisubstituted pyridine, 10a | 5-{5-phenyl-6...)
Affinity DataIC50:  38nMpH: 7.5 T: 2°C. Assay description: Purified recombinant human Akt kinase was monitored for kinase activity in the presence or absence of inhibitors in a 96-well format. Detection was d...
In DepthDetails ArticlePubMed
TargetRAC-alpha serine/threonine-protein kinase(Homo sapiens (Human))
Merck Research Laboratories
LigandPNGBDBM24885(2,3,5-trisubstituted pyridine, 10a | 5-{5-phenyl-6...)
Affinity DataIC50:  123nMpH: 7.5 T: 2°C. Assay description: Purified recombinant human Akt kinase was monitored for kinase activity in the presence or absence of inhibitors in a 96-well format. Detection was d...
In DepthDetails ArticlePubMed