BDBM24898 3-{[(4-chlorophenyl)methyl]sulfanyl}-5-[(methylcarbamoyl)amino]-1,2-thiazole-4-carboxamide::isothiazole, 1
SMILES CNC(=O)Nc1snc(SCc2ccc(Cl)cc2)c1C(N)=O
InChI Key InChIKey=OJNYWHSZTYNGPE-UHFFFAOYSA-N
Data  1 IC50
  Tab Delimited (TSV)   2D SDfile   Computed 3D by Vconf -m prep SDfile
Find this compound or compounds like it in BindingDB:
Activity Spreadsheet -- Enzyme Inhibition Constant Data from BindingDB
Found 1 hit for monomerid = 24898
TargetHigh affinity nerve growth factor receptor(Homo sapiens (Human))
Pfizer
LigandPNGBDBM24898(3-{[(4-chlorophenyl)methyl]sulfanyl}-5-[(methylcar...)
Affinity DataIC50:  7nMpH: 7.4 T: 2°C. Assay description: The kinase domain of the human TrkA receptor in phosphorylation buffer with 0.5 uM ATP is incubated in plates coated with PGT substrate. Compounds ar...
In DepthDetails ArticlePubMed