BDBM249111 US9453034, 35
SMILES CN1CCC2(CC1)C(=N)N[C@@](C)(CS2(=O)=O)c1cc(NC(=O)c2ncc(cc2C)C#N)ccc1F
InChI Key InChIKey=NRUBCOSEKGFZPQ-QHCPKHFHSA-N
Data  2 KI
  Tab Delimited (TSV)   2D SDfile   Computed 3D by Vconf -m prep SDfile
Find this compound or compounds like it in BindingDB:
Activity Spreadsheet -- Enzyme Inhibition Constant Data from BindingDB
Found 2 hits for monomerid = 249111
TargetBeta-secretase 2(Homo sapiens (Human))
Merck Sharp & Dohme
US Patent
LigandPNGBDBM249111(US9453034, 35)
Affinity DataKi:  24nM ΔG°:  -10.6kcal/molepH: 5.0 T: 2°C. Assay description: Inhibitor IC50s at purified human autoBACE-2 are determined in a time-resolved endpoint proteolysis assay that measures hydrolysis of the QSY7-EISEVN...
Ligand InfoPC cidPC sid
In DepthDetails US Patent
TargetBeta-secretase 1(Homo sapiens (Human))
Merck Sharp & Dohme
US Patent
LigandPNGBDBM249111(US9453034, 35)
Affinity DataKi:  35nM ΔG°:  -10.3kcal/molepH: 5.0 T: 2°C. Assay description: A homogeneous time-resolved FRET assay can be used to determine IC50 values for inhibitors of the soluble human BACE1 catalytic domain. This assay mo...
Ligand InfoPC cidPC sid
In DepthDetails US Patent