BDBM249205 US9458105, I-3
SMILES CC(C)(C)c1cc(F)c2c(cnn(-c3cccc(-c4cc[nH]c(=O)c4)c3CO)c2=O)c1
InChI Key InChIKey=XPWHPDCOARLMAB-UHFFFAOYSA-N
Data  1 IC50
  Tab Delimited (TSV)   2D SDfile   Computed 3D by Vconf -m prep SDfile
Find this compound or compounds like it in BindingDB:
Activity Spreadsheet -- Enzyme Inhibition Constant Data from BindingDB
Found 1 hit for monomerid = 249205
TargetTyrosine-protein kinase BTK(Homo sapiens (Human))
Hoffmann-La Roche
US Patent
LigandPNGBDBM249205(US9458105, I-3)
Affinity DataIC50:  366nMpH: 7.15 T: 2°C. Assay description: This BTK competition assay measures compound potency (IC50) for the inactivated state of Bruton's Tyrosine Kinase using FRET (Forster/Fluorescence Re...
Ligand InfoPC cidPC sid
In DepthDetails US Patent