BDBM249282 US10017501, Compound 1020-50::US9458145, 1020-50
SMILES Cc1noc(C)c1-c1cc(NC2CCCC2)c2nc([nH]c2c1)C1CC1
InChI Key InChIKey=UFMRZYYXPWVWNN-UHFFFAOYSA-N
Data  5 IC50
  Tab Delimited (TSV)   2D SDfile   Computed 3D by Vconf -m prep SDfile
Find this compound or compounds like it in BindingDB:
Activity Spreadsheet -- Enzyme Inhibition Constant Data from BindingDB
Found 5 hits for monomerid = 249282
TargetBromodomain-containing protein 4 [368-440](Homo sapiens (Human))
Gilead Sciences
US Patent
LigandPNGBDBM249282(US10017501, Compound 1020-50 | US9458145, 1020-50)
Affinity DataIC50:  318nMpH: 7.5 T: 2°C. Assay description: Binding of the two tandem bromodomains, BRD4-1 and BRD4-2, to an acetylated histone H4 peptide was measured using a homogeneous time resolved fluores...
Ligand InfoPC cidPC sid
In DepthDetails US Patent
TargetBromodomain-containing protein 4 [75-147](Homo sapiens (Human))
Gilead Sciences
US Patent
LigandPNGBDBM249282(US10017501, Compound 1020-50 | US9458145, 1020-50)
Affinity DataIC50:  125nMpH: 7.5 T: 2°C. Assay description: Binding of the bromodomain BRD4-I to an acetylated histone H4 peptide was measured using a bead-based Amplified Luminescent Proximity Homogeneous Ass...
Ligand InfoPC cidPC sid
In DepthDetails US Patent
TargetBromodomain-containing protein 4 [368-440](Homo sapiens (Human))
Gilead Sciences
US Patent
LigandPNGBDBM249282(US10017501, Compound 1020-50 | US9458145, 1020-50)
Affinity DataIC50:  318nM. Assay description: Binding of the two tandem bromodomains, BRD4-1 and BRD4-2, to an acetylated histone H4 peptide was measured using a homogeneous time resolved fluores...
Ligand InfoPC cidPC sid
In DepthDetails US Patent
TargetBromodomain-containing protein 4 [75-147](Homo sapiens (Human))
Gilead Sciences
US Patent
LigandPNGBDBM249282(US10017501, Compound 1020-50 | US9458145, 1020-50)
Affinity DataIC50:  299nM. Assay description: Binding of the two tandem bromodomains, BRD4-1 and BRD4-2, to an acetylated histone H4 peptide was measured using a homogeneous time resolved fluores...
Ligand InfoPC cidPC sid
In DepthDetails US Patent
TargetBromodomain-containing protein 4 [75-147](Homo sapiens (Human))
Gilead Sciences
US Patent
LigandPNGBDBM249282(US10017501, Compound 1020-50 | US9458145, 1020-50)
Affinity DataIC50:  299nMpH: 7.5 T: 2°C. Assay description: Binding of the two tandem bromodomains, BRD4-1 and BRD4-2, to an acetylated histone H4 peptide was measured using a homogeneous time resolved fluores...
Ligand InfoPC cidPC sid
In DepthDetails US Patent