BDBM249291 US10017501, Compound 1020-84::US9458145, 1020-84
SMILES Cc1noc(C)c1-c1cc(-c2c(C)ccnc2C)c2nc[nH]c2c1
InChI Key InChIKey=PNNSPWUDQDPRGS-UHFFFAOYSA-N
Data  5 IC50
  Tab Delimited (TSV)   2D SDfile   Computed 3D by Vconf -m prep SDfile
Find this compound or compounds like it in BindingDB:
Activity Spreadsheet -- Enzyme Inhibition Constant Data from BindingDB
Found 5 hits for monomerid = 249291
TargetBromodomain-containing protein 4 [75-147](Homo sapiens (Human))
Gilead Sciences
US Patent
LigandPNGBDBM249291(US10017501, Compound 1020-84 | US9458145, 1020-84)
Affinity DataIC50:  481nMpH: 7.5 T: 2°C. Assay description: Binding of the two tandem bromodomains, BRD4-1 and BRD4-2, to an acetylated histone H4 peptide was measured using a homogeneous time resolved fluores...
Ligand InfoPC cidPC sid
In DepthDetails US Patent
TargetBromodomain-containing protein 4 [368-440](Homo sapiens (Human))
Gilead Sciences
US Patent
LigandPNGBDBM249291(US10017501, Compound 1020-84 | US9458145, 1020-84)
Affinity DataIC50:  234nMpH: 7.5 T: 2°C. Assay description: Binding of the two tandem bromodomains, BRD4-1 and BRD4-2, to an acetylated histone H4 peptide was measured using a homogeneous time resolved fluores...
Ligand InfoPC cidPC sid
In DepthDetails US Patent
TargetBromodomain-containing protein 4 [368-440](Homo sapiens (Human))
Gilead Sciences
US Patent
LigandPNGBDBM249291(US10017501, Compound 1020-84 | US9458145, 1020-84)
Affinity DataIC50:  234nM. Assay description: Binding of the two tandem bromodomains, BRD4-1 and BRD4-2, to an acetylated histone H4 peptide was measured using a homogeneous time resolved fluores...
Ligand InfoPC cidPC sid
In DepthDetails US Patent
TargetBromodomain-containing protein 4 [75-147](Homo sapiens (Human))
Gilead Sciences
US Patent
LigandPNGBDBM249291(US10017501, Compound 1020-84 | US9458145, 1020-84)
Affinity DataIC50:  481nM. Assay description: Binding of the two tandem bromodomains, BRD4-1 and BRD4-2, to an acetylated histone H4 peptide was measured using a homogeneous time resolved fluores...
Ligand InfoPC cidPC sid
In DepthDetails US Patent
TargetBromodomain-containing protein 4 [75-147](Homo sapiens (Human))
Gilead Sciences
US Patent
LigandPNGBDBM249291(US10017501, Compound 1020-84 | US9458145, 1020-84)
Affinity DataIC50:  277nMpH: 7.5 T: 2°C. Assay description: Binding of the bromodomain BRD4-I to an acetylated histone H4 peptide was measured using a bead-based Amplified Luminescent Proximity Homogeneous Ass...
Ligand InfoPC cidPC sid
In DepthDetails US Patent