BDBM249363 US9464062, 7
SMILES O=C1OC(CN2CCN(CC2)C(c2ccccc2)c2ccccc2)CN1C1CC1
InChI Key InChIKey=NXSJZUVQWSGQBQ-UHFFFAOYSA-N
Data  1 IC50
  Tab Delimited (TSV)   2D SDfile   Computed 3D by Vconf -m prep SDfile
Find this compound or compounds like it in BindingDB:
Activity Spreadsheet -- Enzyme Inhibition Constant Data from BindingDB
Found 1 hit for monomerid = 249363
Target5-hydroxytryptamine receptor 2B(Homo sapiens (Human))
Temple University
US Patent
LigandPNGBDBM249363(US9464062, 7)
Affinity DataIC50:  298nMpH: 7.4Assay Description:A solution of the compound of the disclosure to be tested is prepared as a 1-mg/ml stock in Assay Buffer (50 mM Tris-HCl, 10 mM MgCl2, 1 mM EDTA, pH ...
Ligand InfoPC cidPC sid
In DepthDetails US Patent