BDBM249373 US9464081, 6
SMILES [#6]\[#6](-[#6])=[#6](/F)-[#6]-[#7]-[#6](=O)-[#6@@H]-1-[#6][C@@]2([#6]-[#8])[#6]-[#6@H]2-[#7]-1-[#6](=O)-[#6]-n1nc(-[#6](-[#7])=O)c2ccccc12
InChI Key InChIKey=NCNTUCWKLIWRAL-JKSBSHDWSA-N
Data  1 IC50
  Tab Delimited (TSV)   2D SDfile   Computed 3D by Vconf -m prep SDfile
Find this compound or compounds like it in BindingDB:
Activity Spreadsheet -- Enzyme Inhibition Constant Data from BindingDB
Found 1 hit for monomerid = 249373
TargetComplement factor D(Homo sapiens (Human))
Novartis
US Patent
LigandPNGBDBM249373(US9464081, 6)
Affinity DataIC50:  99nMpH: 7.5 T: 2°C. Assay description: Method 1: Recombinant human factor D (expressed in E. coli and purified using standard methods) at 10 nM concentration is incubated with test compoun...
Ligand InfoPC cidPC sid
In DepthDetails US Patent