BDBM249498 US10072016, Compound 96::US10407433, Compound 96::US10913746, Compound 96::US11649240, Compound 96::US9434727, 96::US9777010, Compound 96
SMILES CCN1Cc2[nH]nc(C(=O)N3CCC(CC3)c3ccc(F)c(F)c3C(F)(F)F)c2C1
InChI Key InChIKey=YOWKPWSHXYIUJQ-UHFFFAOYSA-N
Data  9 IC50
  Tab Delimited (TSV)   2D SDfile   Computed 3D by Vconf -m prep SDfile
Find this compound or compounds like it in BindingDB:
Activity Spreadsheet -- Enzyme Inhibition Constant Data from BindingDB
Found 9 hits for monomerid = 249498
TargetRetinol-binding protein 4(Homo sapiens (Human))
Columbia University
US Patent
LigandPNGBDBM249498(US10072016, Compound 96 | US10407433, Compound 96 ...)
Affinity DataIC50:  12.7nMpH: 7.4 T: 2°C. Assay description: Untagged human RBP4 purified from urine of tubular proteinuria patients was purchased from Fitzgerald Industries International. It was biotinylated u...
Ligand InfoPC cidPC sid
In DepthDetails US Patent
TargetRetinol-binding protein 4(Homo sapiens (Human))
Columbia University
US Patent
LigandPNGBDBM249498(US10072016, Compound 96 | US10407433, Compound 96 ...)
Affinity DataIC50:  26.5nMpH: 7.5 T: 2°C. Assay description: TR-FRET assay for retinol-induced RBP4-TTR interaction Binding of a desired RBP4 antagonist displaces retinol and induces hindrance for RBP4-TTR inte...
Ligand InfoPC cidPC sid
In DepthDetails US Patent
TargetRetinol-binding protein 4(Homo sapiens (Human))
Columbia University
US Patent
LigandPNGBDBM249498(US10072016, Compound 96 | US10407433, Compound 96 ...)
Affinity DataIC50:  12.7nMpH: 7.5Assay Description:Binding of a desired RBP4 antagonist displaces retinol and induces hindrance for RBP4-TTR interaction resulting in the decreased FRET signal (FIG. 7)...
Ligand InfoPC cidPC sid
In DepthDetails US Patent
TargetTransthyretin(Homo sapiens (Human))
Columbia University
US Patent
LigandPNGBDBM249498(US10072016, Compound 96 | US10407433, Compound 96 ...)
Affinity DataIC50:  26.5nMpH: 7.4 T: 2°C. Assay description: Untagged human RBP4 purified from urine of tubular proteinuria patients was purchased from Fitzgerald Industries International. It was biotinylated u...
Ligand InfoPC cidPC sid
In DepthDetails US Patent
TargetRetinol-binding protein 4(Homo sapiens (Human))
Columbia University
US Patent
LigandPNGBDBM249498(US10072016, Compound 96 | US10407433, Compound 96 ...)
Affinity DataIC50:  26.5nM. Assay description: Binding of a desired RBP4 antagonist displaces retinol and induces hindrance for RBP4-TTR interaction resulting in the decreased FRET signal (FIG. 7 ...
Ligand InfoPC cidPC sid
In DepthDetails US Patent
TargetRetinol-binding protein 4(Homo sapiens (Human))
Columbia University
US Patent
LigandPNGBDBM249498(US10072016, Compound 96 | US10407433, Compound 96 ...)
Affinity DataIC50:  12.7nM. Assay description: Untagged human RBP4 purified from urine of tubular proteinuria patients was purchased from Fitzgerald Industries International. It was biotinylated u...
Ligand InfoPC cidPC sid
In DepthDetails US Patent
TargetRetinol-binding protein 4(Homo sapiens (Human))
Columbia University
US Patent
LigandPNGBDBM249498(US10072016, Compound 96 | US10407433, Compound 96 ...)
Affinity DataIC50:  12.7nM. Assay description: Untagged human RBP4 purified from urine of tubular proteinuria patients was purchased from Fitzgerald Industries International. It was biotinylated u...
Ligand InfoPC cidPC sid
In DepthDetails US Patent
TargetRetinol-binding protein 4(Homo sapiens (Human))
Columbia University
US Patent
LigandPNGBDBM249498(US10072016, Compound 96 | US10407433, Compound 96 ...)
Affinity DataIC50:  12.7nM. Assay description: The analogs of Compounds 63-162 described herein analogously bind to RBP4 and antagonize retinol-dependent RBP4-TTR interaction. Additional piperidin...
Ligand InfoPC cidPC sid
In DepthDetails US Patent
TargetRetinol-binding protein 4(Homo sapiens (Human))
Columbia University
US Patent
LigandPNGBDBM249498(US10072016, Compound 96 | US10407433, Compound 96 ...)
Affinity DataIC50:  12.7nM. Assay description: Untagged human RBP4 purified from urine of tubular proteinuria patients was purchased from Fitzgerald Industries International. It was biotinylated u...
Ligand InfoPC cidPC sid
In DepthDetails US Patent