BDBM249523 US10072016, Compound 121::US10407433, Compound 121::US10913746, Compound 121::US11649240, Compound 121::US9434727, 121::US9777010, Compound 121
SMILES CC(C)C(=O)N1CCc2c(C1)[nH]nc2C(=O)N1CCC(CC1)c1ccc(F)c(F)c1C(F)(F)F
InChI Key InChIKey=BKDCWIRSLJFLBQ-UHFFFAOYSA-N
Data  9 IC50
  Tab Delimited (TSV)   2D SDfile   Computed 3D by Vconf -m prep SDfile
Find this compound or compounds like it in BindingDB:
Activity Spreadsheet -- Enzyme Inhibition Constant Data from BindingDB
Found 9 hits for monomerid = 249523
TargetRetinol-binding protein 4(Homo sapiens (Human))
Columbia University
US Patent
LigandPNGBDBM249523(US10072016, Compound 121 | US10407433, Compound 12...)
Affinity DataIC50:  8.84nMpH: 7.4 T: 2°C. Assay description: Untagged human RBP4 purified from urine of tubular proteinuria patients was purchased from Fitzgerald Industries International. It was biotinylated u...
Ligand InfoPC cidPC sid
In DepthDetails US Patent
TargetRetinol-binding protein 4(Homo sapiens (Human))
Columbia University
US Patent
LigandPNGBDBM249523(US10072016, Compound 121 | US10407433, Compound 12...)
Affinity DataIC50:  31.8nMpH: 7.5 T: 2°C. Assay description: TR-FRET assay for retinol-induced RBP4-TTR interaction Binding of a desired RBP4 antagonist displaces retinol and induces hindrance for RBP4-TTR inte...
Ligand InfoPC cidPC sid
In DepthDetails US Patent
TargetRetinol-binding protein 4(Homo sapiens (Human))
Columbia University
US Patent
LigandPNGBDBM249523(US10072016, Compound 121 | US10407433, Compound 12...)
Affinity DataIC50:  8.84nMpH: 7.5Assay Description:Binding of a desired RBP4 antagonist displaces retinol and induces hindrance for RBP4-TTR interaction resulting in the decreased FRET signal (FIG. 7)...
Ligand InfoPC cidPC sid
In DepthDetails US Patent
TargetTransthyretin(Homo sapiens (Human))
Columbia University
US Patent
LigandPNGBDBM249523(US10072016, Compound 121 | US10407433, Compound 12...)
Affinity DataIC50:  31.8nMpH: 7.4 T: 2°C. Assay description: Untagged human RBP4 purified from urine of tubular proteinuria patients was purchased from Fitzgerald Industries International. It was biotinylated u...
Ligand InfoPC cidPC sid
In DepthDetails US Patent
TargetRetinol-binding protein 4(Homo sapiens (Human))
Columbia University
US Patent
LigandPNGBDBM249523(US10072016, Compound 121 | US10407433, Compound 12...)
Affinity DataIC50:  31.8nM. Assay description: Binding of a desired RBP4 antagonist displaces retinol and induces hindrance for RBP4-TTR interaction resulting in the decreased FRET signal (FIG. 7 ...
Ligand InfoPC cidPC sid
In DepthDetails US Patent
TargetRetinol-binding protein 4(Homo sapiens (Human))
Columbia University
US Patent
LigandPNGBDBM249523(US10072016, Compound 121 | US10407433, Compound 12...)
Affinity DataIC50:  8.84nM. Assay description: Untagged human RBP4 purified from urine of tubular proteinuria patients was purchased from Fitzgerald Industries International. It was biotinylated u...
Ligand InfoPC cidPC sid
In DepthDetails US Patent
TargetRetinol-binding protein 4(Homo sapiens (Human))
Columbia University
US Patent
LigandPNGBDBM249523(US10072016, Compound 121 | US10407433, Compound 12...)
Affinity DataIC50:  8.84nM. Assay description: Untagged human RBP4 purified from urine of tubular proteinuria patients was purchased from Fitzgerald Industries International. It was biotinylated u...
Ligand InfoPC cidPC sid
In DepthDetails US Patent
TargetRetinol-binding protein 4(Homo sapiens (Human))
Columbia University
US Patent
LigandPNGBDBM249523(US10072016, Compound 121 | US10407433, Compound 12...)
Affinity DataIC50:  8.84nM. Assay description: The analogs of Compounds 63-162 described herein analogously bind to RBP4 and antagonize retinol-dependent RBP4-TTR interaction. Additional piperidin...
Ligand InfoPC cidPC sid
In DepthDetails US Patent
TargetRetinol-binding protein 4(Homo sapiens (Human))
Columbia University
US Patent
LigandPNGBDBM249523(US10072016, Compound 121 | US10407433, Compound 12...)
Affinity DataIC50:  8.84nM. Assay description: Untagged human RBP4 purified from urine of tubular proteinuria patients was purchased from Fitzgerald Industries International. It was biotinylated u...
Ligand InfoPC cidPC sid
In DepthDetails US Patent