BDBM24960 (aminomethyl)(methyl)phosphinic acid::organophosphorus derivative, 2
SMILES CP(O)(O)C=N
InChI Key InChIKey=PFISDCJTBSEFHD-UHFFFAOYSA-N
Data  2 KI  2 IC50
  Tab Delimited (TSV)   2D SDfile   Computed 3D by Vconf -m prep SDfile
Find this compound or compounds like it in BindingDB:
Activity Spreadsheet -- Enzyme Inhibition Constant Data from BindingDB
Found 2 hits for monomerid = 24960
TargetUrease subunit alpha/beta/gamma(Bacillus pasteurii)
Wroclaw University Of Technology
LigandPNGBDBM24960((aminomethyl)(methyl)phosphinic acid | organophosp...)
Affinity DataKi:  3.40E+5nM ΔG°:  -4.81kcal/mole IC50:  1.10E+6nMpH: 7.0 T: 2°C. Assay description: Progress curves were obtained by initiation of urease reaction with addition of purified enzyme into assay mixtures containing increasing concentrati...
In DepthDetails ArticlePubMed
TargetUrease subunit alpha [F36L]/beta/gamma(Proteus vulgaris)
Wroclaw University Of Technology
LigandPNGBDBM24960((aminomethyl)(methyl)phosphinic acid | organophosp...)
Affinity DataKi:  4.25E+5nM ΔG°:  -4.67kcal/mole IC50:  2.53E+6nMpH: 7.0 T: 2°C. Assay description: Progress curves were obtained by initiation of urease reaction with addition of purified enzyme into assay mixtures containing increasing concentrati...
In DepthDetails ArticlePubMed