BDBM249718 US9447038, 146
SMILES COc1cc(CN(CC2CCCC2)C(CC(O)=O)c2ccc3OCCc3c2)ccc1OCCN1C(=O)CCC1=O
InChI Key InChIKey=VMKKWKQRLVWVKB-UHFFFAOYSA-N
Data  1 IC50
  Tab Delimited (TSV)   2D SDfile   Computed 3D by Vconf -m prep SDfile
Find this compound or compounds like it in BindingDB:
Activity Spreadsheet -- Enzyme Inhibition Constant Data from BindingDB
Found 1 hit for monomerid = 249718
TargetC-X-C motif chemokine 10(Homo sapiens (Human))
Sanofi
US Patent
LigandPNGBDBM249718(US9447038, 146)
Affinity DataIC50:  56nMT: 2°C. Assay description: The composition of the binding assay buffer is determined in a course of detailed optimization procedure. This resulted in a binding assay buffer con...
Ligand InfoPC cidPC sid
In DepthDetails US Patent