BDBM249821 US9447087, 55
SMILES Clc1cnccc1C1N=C(Nc2nc3ccccc3o2)NC2=C1C(=O)CCC2
InChI Key InChIKey=AJDHTVQFKUSSAY-UHFFFAOYSA-N
Data  1 IC50
  Tab Delimited (TSV)   2D SDfile   Computed 3D by Vconf -m prep SDfile
Find this compound or compounds like it in BindingDB:
Activity Spreadsheet -- Enzyme Inhibition Constant Data from BindingDB
Found 1 hit for monomerid = 249821
TargetGalactokinase(Homo sapiens (Human))
University Of Utah Research Foundation
US Patent
LigandPNGBDBM249821(US9447087, 55)
Affinity DataIC50:  1.53E+4nM. Assay description: Assay details and protocol: The primary assay monitored ATP depletion using Promega's KinaseGlo technology, where ATP levels are measured through...
Ligand InfoPC cidPC sid
In DepthDetails US Patent