BDBM249838 US9447087, 75
SMILES Clc1c[nH]nc1C1NC(Nc2nc3ccccc3o2)=NC2=C1C(=O)CCC2
InChI Key
Data  1 IC50
  Tab Delimited (TSV)   2D SDfile   Computed 3D by Vconf -m prep SDfile
Find this compound or compounds like it in BindingDB:
Activity Spreadsheet -- Enzyme Inhibition Constant Data from BindingDB
Found 1 hit for monomerid = 249838
TargetGalactokinase(Homo sapiens (Human))
University Of Utah Research Foundation
US Patent
LigandPNGBDBM249838(US9447087, 75)
Affinity DataIC50:  2.91E+3nM. Assay description: Assay details and protocol: The primary assay monitored ATP depletion using Promega's KinaseGlo technology, where ATP levels are measured through...
Ligand InfoPC cidPC sid
In DepthDetails US Patent