BDBM249854 US9447087, 92
SMILES CC1=C(C(N=C(Nc2nc3ccccc3o2)N1)c1ccccc1Br)C(=O)NCc1ccccc1
InChI Key InChIKey=QBCDATKPKXUQHJ-UHFFFAOYSA-N
Data  1 IC50
  Tab Delimited (TSV)   2D SDfile   Computed 3D by Vconf -m prep SDfile
Find this compound or compounds like it in BindingDB:
Activity Spreadsheet -- Enzyme Inhibition Constant Data from BindingDB
Found 1 hit for monomerid = 249854
TargetGalactokinase(Homo sapiens (Human))
University Of Utah Research Foundation
US Patent
LigandPNGBDBM249854(US9447087, 92)
Affinity DataIC50:  6.51E+3nM. Assay description: Assay details and protocol: The primary assay monitored ATP depletion using Promega's KinaseGlo technology, where ATP levels are measured through...
Ligand InfoPC cidPC sid
In DepthDetails US Patent