BDBM250011 US9447106, 134a (peak 1)
SMILES NC(=O)c1c2NCC[C@H](c3ccccc3NC(=O)C=C)n2nc1-c1ccc(Cl)cc1
InChI Key InChIKey=GJOMMDPXVSZLQK-QGZVFWFLSA-N
Data  1 IC50
  Tab Delimited (TSV)   2D SDfile   Computed 3D by Vconf -m prep SDfile
Find this compound or compounds like it in BindingDB:
Activity Spreadsheet -- Enzyme Inhibition Constant Data from BindingDB
Found 1 hit for monomerid = 250011
TargetTyrosine-protein kinase BTK(Homo sapiens (Human))
Beigene
US Patent
LigandPNGBDBM250011(US9447106, 134a (peak 1))
Affinity DataIC50:  0.640nMT: 2°C. Assay description: Compounds disclosed herein were tested for inhibition of Btk kinase activity in an assay based on time-resolved fluorescence resonance energy transfe...
Ligand InfoPC cidPC sid
In DepthDetails US Patent