BDBM250014 US10005782, Compound 136::US9447106, 136::US9556188, Compound 136
SMILES NC(=O)c1c(nn2c(c[nH]c12)C1CCN(CC1)C(=O)C=C)-c1ccc(Oc2ccccc2)cc1
InChI Key InChIKey=FQTTXADHIKDUOM-UHFFFAOYSA-N
Data  9 IC50
  Tab Delimited (TSV)   2D SDfile   Computed 3D by Vconf -m prep SDfile
Find this compound or compounds like it in BindingDB:
Activity Spreadsheet -- Enzyme Inhibition Constant Data from BindingDB
Found 9 hits for monomerid = 250014
TargetTyrosine-protein kinase BTK(Homo sapiens (Human))
Beigene
US Patent
LigandPNGBDBM250014(US10005782, Compound 136 | US9447106, 136 | US9556...)
Affinity DataIC50:  0.130nMT: 2°C. Assay description: Compounds disclosed herein were tested for inhibition of Btk kinase activity in an assay based on time-resolved fluorescence resonance energy transfe...
Ligand InfoPC cidPC sid
In DepthDetails US Patent
TargetTyrosine-protein kinase BTK(Homo sapiens (Human))
Beigene
US Patent
LigandPNGBDBM250014(US10005782, Compound 136 | US9447106, 136 | US9556...)
Affinity DataIC50:  0.130nMT: 2°C. Assay description: Compounds disclosed herein were tested for inhibition of Btk kinase activity in an assay based on time-resolved fluorescence resonance energy transfe...
Ligand InfoPC cidPC sid
In DepthDetails US Patent
TargetTyrosine-protein kinase BTK(Homo sapiens (Human))
Beigene
US Patent
LigandPNGBDBM250014(US10005782, Compound 136 | US9447106, 136 | US9556...)
Affinity DataIC50:  0.130nM. Assay description: Compounds disclosed herein were tested for inhibition of Btk kinase activity in an assay based on time-resolved fluorescence resonance energy transfe...
Ligand InfoPC cidPC sid
In DepthDetails US Patent
TargetTyrosine-protein kinase BTK(Homo sapiens (Human))
Beigene
US Patent
LigandPNGBDBM250014(US10005782, Compound 136 | US9447106, 136 | US9556...)
Affinity DataIC50:  0.130nM. Assay description: Inhibition of N-terminal His-tagged recombinant human BTK (393 to 659 residues) expressed in baculovirus infected Sf9 cells preincubated for 1 hr fol...
Ligand InfoPC cidPC sid
In DepthDetails ArticlePubMed
TargetTyrosine-protein kinase BTK(Homo sapiens (Human))
Beigene
US Patent
LigandPNGBDBM250014(US10005782, Compound 136 | US9447106, 136 | US9556...)
Affinity DataIC50:  0.800nM. Assay description: Inhibition of BTK in human Ramos cells assessed as reduction in BTK phosphorylation at Tyr223 residue preincubated for 1 hr followed by pervanadate o...
Ligand InfoPC cidPC sid
In DepthDetails ArticlePubMed
TargetTyrosine-protein kinase BTK(Homo sapiens (Human))
Beigene
US Patent
LigandPNGBDBM250014(US10005782, Compound 136 | US9447106, 136 | US9556...)
Affinity DataIC50:  0.800nM. Assay description: Inhibition of BTK in human Ramos cells assessed as reduction in BTK phosphorylation at Tyr223 residue preincubated for 1 hr followed by pervanadate o...
Ligand InfoPC cidPC sid
In DepthDetails ArticlePubMed
TargetTyrosine-protein kinase BTK(Homo sapiens (Human))
Beigene
US Patent
LigandPNGBDBM250014(US10005782, Compound 136 | US9447106, 136 | US9556...)
Affinity DataIC50:  0.130nM. Assay description: Inhibition of N-terminal His-tagged recombinant human BTK (393 to 659 residues) expressed in baculovirus infected Sf9 cells preincubated for 1 hr fol...
Ligand InfoPC cidPC sid
In DepthDetails ArticlePubMed
TargetEpidermal growth factor receptor(Homo sapiens (Human))
TBA
Curated by ChEMBL
LigandPNGBDBM250014(US10005782, Compound 136 | US9447106, 136 | US9556...)
Affinity DataIC50: <0.25nM. Assay description: Inhibition of EGFR (unknown origin) preincubated for 1 hr followed by Biotin-AVLESEEELYSSARQ-NH2 substrate addition in presence of ATP and measured a...
Ligand InfoPC cidPC sid
In DepthDetails ArticlePubMed
TargetEpidermal growth factor receptor(Homo sapiens (Human))
TBA
Curated by ChEMBL
LigandPNGBDBM250014(US10005782, Compound 136 | US9447106, 136 | US9556...)
Affinity DataIC50: <0.25nM. Assay description: Inhibition of EGFR (unknown origin) preincubated for 1 hr followed by Biotin-AVLESEEELYSSARQ-NH2 substrate addition in presence of ATP and measured a...
Ligand InfoPC cidPC sid
In DepthDetails ArticlePubMed