BDBM250063 US10005782, Compound 188::US9447106, 188::US9556188, Compound 188
SMILES CN(C)CC#CC(=O)N1CCC(CC1)[C@@H]1CCNc2c(C(N)=O)c(nn12)-c1ccc(Oc2ccccc2)cc1
InChI Key InChIKey=BARNJOKJZIDSCL-VWLOTQADSA-N
Data  3 IC50
  Tab Delimited (TSV)   2D SDfile   Computed 3D by Vconf -m prep SDfile
Find this compound or compounds like it in BindingDB:
Activity Spreadsheet -- Enzyme Inhibition Constant Data from BindingDB
Found 3 hits for monomerid = 250063
TargetTyrosine-protein kinase BTK(Homo sapiens (Human))
Beigene
US Patent
LigandPNGBDBM250063(US10005782, Compound 188 | US9447106, 188 | US9556...)
Affinity DataIC50:  1.10nMT: 2°C. Assay description: Compounds disclosed herein were tested for inhibition of Btk kinase activity in an assay based on time-resolved fluorescence resonance energy transfe...
Ligand InfoPC cidPC sid
In DepthDetails US Patent
TargetTyrosine-protein kinase BTK(Homo sapiens (Human))
Beigene
US Patent
LigandPNGBDBM250063(US10005782, Compound 188 | US9447106, 188 | US9556...)
Affinity DataIC50:  1.10nM. Assay description: Compounds disclosed herein were tested for inhibition of Btk kinase activity in an assay based on time-resolved fluorescence resonance energy transfe...
Ligand InfoPC cidPC sid
In DepthDetails US Patent
TargetTyrosine-protein kinase BTK(Homo sapiens (Human))
Beigene
US Patent
LigandPNGBDBM250063(US10005782, Compound 188 | US9447106, 188 | US9556...)
Affinity DataIC50:  1.10nMT: 2°C. Assay description: Compounds disclosed herein were tested for inhibition of Btk kinase activity in an assay based on time-resolved fluorescence resonance energy transfe...
Ligand InfoPC cidPC sid
In DepthDetails US Patent