BDBM250087 US9447106, 33a (peak 1)::US9556188, Compound 33b
SMILES NC(=O)c1c2NCC[C@H](CNC(=O)C=C)n2nc1-c1ccc(Oc2ccccc2)cc1
InChI Key InChIKey=JTLIXOUWXJJHBC-MRXNPFEDSA-N
Data  2 IC50
  Tab Delimited (TSV)   2D SDfile   Computed 3D by Vconf -m prep SDfile
Find this compound or compounds like it in BindingDB:
Activity Spreadsheet -- Enzyme Inhibition Constant Data from BindingDB
Found 2 hits for monomerid = 250087
TargetTyrosine-protein kinase BTK(Homo sapiens (Human))
Beigene
US Patent
LigandPNGBDBM250087(US9447106, 33a (peak 1) | US9556188, Compound 33b)
Affinity DataIC50:  11nMT: 2°C. Assay description: Compounds disclosed herein were tested for inhibition of Btk kinase activity in an assay based on time-resolved fluorescence resonance energy transfe...
Ligand InfoPC cidPC sid
In DepthDetails US Patent
TargetTyrosine-protein kinase BTK(Homo sapiens (Human))
Beigene
US Patent
LigandPNGBDBM250087(US9447106, 33a (peak 1) | US9556188, Compound 33b)
Affinity DataIC50:  0.600nMT: 2°C. Assay description: Compounds disclosed herein were tested for inhibition of Btk kinase activity in an assay based on time-resolved fluorescence resonance energy transfe...
Ligand InfoPC cidPC sid
In DepthDetails US Patent