BDBM250420 US9464044, 10
SMILES Cc1cccc(F)c1S(=O)(=O)NCC1(CC1)C(=O)N[C@H]1C2CC3CC1CC(C3)(C2)C(N)=O
InChI Key InChIKey=PCHPQIFQXAIEPO-OBGJIAEMSA-N
Data  1 IC50
  Tab Delimited (TSV)   2D SDfile   Computed 3D by Vconf -m prep SDfile
Find this compound or compounds like it in BindingDB:
Activity Spreadsheet -- Enzyme Inhibition Constant Data from BindingDB
Found 1 hit for monomerid = 250420
Target11-beta-hydroxysteroid dehydrogenase 1(Homo sapiens (Human))
Ahn-Gook Pharmaceutical
US Patent
LigandPNGBDBM250420(US9464044, 10)
Affinity DataIC50:  2.5nMpH: 6.0 T: 2°C. Assay description: The inhibiting activity of 11β-HSD1 derived from microsomal fractions was measured using the HTRF assay (62CO2PEB, Cisbio). Different concentrat...
Ligand InfoPC cidPC sid
In DepthDetails US Patent