BDBM250439 US9464044, 33
SMILES OCCC(=O)C12CC3CC(C1)[C@H](NC(=O)C1(CNS(=O)(=O)c4ccccc4F)CC1)C(C3)C2
InChI Key InChIKey=JEJMTHXNLZACJL-GZLODIHRSA-N
Data  1 IC50
  Tab Delimited (TSV)   2D SDfile   Computed 3D by Vconf -m prep SDfile
Find this compound or compounds like it in BindingDB:
Activity Spreadsheet -- Enzyme Inhibition Constant Data from BindingDB
Found 1 hit for monomerid = 250439
Target11-beta-hydroxysteroid dehydrogenase 1(Homo sapiens (Human))
Ahn-Gook Pharmaceutical
US Patent
LigandPNGBDBM250439(US9464044, 33)
Affinity DataIC50:  1.5nMpH: 6.0 T: 2°C. Assay description: The inhibiting activity of 11β-HSD1 derived from microsomal fractions was measured using the HTRF assay (62CO2PEB, Cisbio). Different concentrat...
Ligand InfoPC cidPC sid
In DepthDetails US Patent