BDBM250441 US9464044, 36
SMILES NC(=O)C12CC3CC(C1)[C@H](NC(=O)C1(CNS(=O)(=O)c4cc(F)c(F)cc4F)CC1)C(C3)C2
InChI Key InChIKey=APBPDUBLZWAACR-ZTQLEBNLSA-N
Data  2 IC50
  Tab Delimited (TSV)   2D SDfile   Computed 3D by Vconf -m prep SDfile
Find this compound or compounds like it in BindingDB:
Activity Spreadsheet -- Enzyme Inhibition Constant Data from BindingDB
Found 2 hits for monomerid = 250441
Target11-beta-hydroxysteroid dehydrogenase 1(Homo sapiens (Human))
Ahn-Gook Pharmaceutical
US Patent
LigandPNGBDBM250441(US9464044, 36)
Affinity DataIC50:  15.4nMpH: 6.0 T: 2°C. Assay description: The inhibiting activity of 11β-HSD1 derived from microsomal fractions was measured using the HTRF assay (62CO2PEB, Cisbio). Different concentrat...
Ligand InfoPC cidPC sid
In DepthDetails US Patent
Target11-beta-hydroxysteroid dehydrogenase 1(Homo sapiens (Human))
Ahn-Gook Pharmaceutical
US Patent
LigandPNGBDBM250441(US9464044, 36)
Affinity DataIC50:  73nMpH: 6.0 T: 2°C. Assay description: The inhibiting activity of 11β-HSD1 derived from microsomal fractions was measured using the HTRF assay (62CO2PEB, Cisbio). Different concentrat...
Ligand InfoPC cidPC sid
In DepthDetails US Patent