BDBM250494 US9464044, 129
SMILES NC(=O)C12CC3CC(C1)[C@H](NC(=O)c1cc(NS(=O)(=O)c4cc(Cl)cc(Cl)c4)ccc1Cl)C(C3)C2
InChI Key InChIKey=OBMWETRQDOPWRZ-FUHUOBGMSA-N
Data  1 IC50
  Tab Delimited (TSV)   2D SDfile   Computed 3D by Vconf -m prep SDfile
Find this compound or compounds like it in BindingDB:
Activity Spreadsheet -- Enzyme Inhibition Constant Data from BindingDB
Found 1 hit for monomerid = 250494
Target11-beta-hydroxysteroid dehydrogenase 1(Homo sapiens (Human))
Ahn-Gook Pharmaceutical
US Patent
LigandPNGBDBM250494(US9464044, 129)
Affinity DataIC50:  41.8nMpH: 6.0 T: 2°C. Assay description: The inhibiting activity of 11β-HSD1 derived from microsomal fractions was measured using the HTRF assay (62CO2PEB, Cisbio). Different concentrat...
Ligand InfoPC cidPC sid
In DepthDetails US Patent