BDBM250650 US9447148, 9.19
SMILES NC(=N)NCCC[C@@H]1NC(=O)[C@@H](Cc2ccccc2)NC(=O)[C@H](Cc2c[nH]cn2)NC(=O)[C@H](CCC(=O)NCC[C@H](NC1=O)C(=O)N[C@@H](Cc1c[nH]c2ccccc12)C(N)=O)NC(=O)C1CC1
InChI Key
Data  2 KI  1 EC50
  Tab Delimited (TSV)   2D SDfile   Computed 3D by Vconf -m prep SDfile
Find this compound or compounds like it in BindingDB:
Activity Spreadsheet -- Enzyme Inhibition Constant Data from BindingDB
Found 3 hits for monomerid = 250650
TargetMelanocyte-stimulating hormone receptor(Homo sapiens (Human))
Palatin Technologies
US Patent
LigandPNGBDBM250650(US9447148, 9.19)
Affinity DataKi:  3nM ΔG°:  -12.1kcal/molepH: 7.5 T: 2°C. Assay description: A competitive inhibition binding assay was performed using membrane homogenates prepared from HEK-293 cells that express recombinant hMCR-1a or hMCR-...
Ligand InfoPC cidPC sid
In DepthDetails US Patent
TargetMelanocortin receptor 4(Homo sapiens (Human))
Palatin Technologies
US Patent
LigandPNGBDBM250650(US9447148, 9.19)
Affinity DataKi:  640nM ΔG°:  -8.78kcal/molepH: 7.5 T: 2°C. Assay description: A competitive inhibition binding assay was performed using membrane homogenates prepared from HEK-293 cells that express recombinant hMCR-1a or hMCR-...
Ligand InfoPC cidPC sid
In DepthDetails US Patent
TargetMelanocyte-stimulating hormone receptor(Homo sapiens (Human))
Palatin Technologies
US Patent
LigandPNGBDBM250650(US9447148, 9.19)
Affinity DataEC50:  0.0310nMpH: 7.5 T: 2°C. Assay description: Accumulation of intracellular cAMP was examined as a measure of the ability of the peptides of the present invention to elicit a functional response ...
Ligand InfoPC cidPC sid
In DepthDetails US Patent