BDBM250750 US9452986, 54
SMILES Fc1ccc(cc1)N1CC(CC1=O)NC(=O)c1ccc2cc(Oc3ccc(cn3)C(F)(F)F)ccc2n1
InChI Key InChIKey=MVCGVBDMNXNYPS-UHFFFAOYSA-N
Data  1 IC50
  Tab Delimited (TSV)   2D SDfile   Computed 3D by Vconf -m prep SDfile
Find this compound or compounds like it in BindingDB:
Activity Spreadsheet -- Enzyme Inhibition Constant Data from BindingDB
Found 1 hit for monomerid = 250750
TargetSodium channel protein type 9 subunit alpha(Homo sapiens (Human))
Abbvie
US Patent
LigandPNGBDBM250750(US9452986, 54)
Affinity DataIC50:  409nMT: 2°C. Assay description: Two days prior to the experiment, frozen HEK293 cells stably expressing recombinant human Nav1.7 were quickly thawed and plated at 25,000 cells/well ...
Ligand InfoPC cidPC sid
In DepthDetails US Patent