BDBM251480 US9452998, 29
SMILES N[C@H]1[C@H]2CO[C@@H]1CN(C2)c1cccnc1NC(=O)c1nc(cnc1N)-c1nc(ccc1C(F)(F)F)N1CCOCC1
InChI Key InChIKey=NGBKJSCBALSPIB-DJKXOVBDSA-N
Data  2 IC50
  Tab Delimited (TSV)   2D SDfile   Computed 3D by Vconf -m prep SDfile
Find this compound or compounds like it in BindingDB:
Activity Spreadsheet -- Enzyme Inhibition Constant Data from BindingDB
Found 2 hits for monomerid = 251480
TargetProtein kinase C theta type(Homo sapiens (Human))
Novartis
US Patent
LigandPNGBDBM251480(US9452998, 29)
Affinity DataIC50:  6nMpH: 7.4Assay Description:The compounds of formula I were tested for their activity on different PKC isoforms according to a published method (D. Geiges et al. Biochem. Pharma...
Ligand InfoPC cidPC sid
In DepthDetails US Patent
TargetProtein kinase C alpha type(Homo sapiens (Human))
Novartis
US Patent
LigandPNGBDBM251480(US9452998, 29)
Affinity DataIC50:  0.240nMpH: 7.4Assay Description:The compounds of formula I were tested for their activity on different PKC isoforms according to a published method (D. Geiges et al. Biochem. Pharma...
Ligand InfoPC cidPC sid
In DepthDetails US Patent