BDBM251493 US9452998, 42
SMILES CC1(N)CCN(CC1)c1cccnc1NC(=O)c1nc(cnc1N)-c1cc(ccc1C(F)(F)F)N1CCOCC1
InChI Key InChIKey=WNEWTOQENXHIHL-UHFFFAOYSA-N
Data  2 IC50
  Tab Delimited (TSV)   2D SDfile   Computed 3D by Vconf -m prep SDfile
Find this compound or compounds like it in BindingDB:
Activity Spreadsheet -- Enzyme Inhibition Constant Data from BindingDB
Found 2 hits for monomerid = 251493
TargetProtein kinase C theta type(Homo sapiens (Human))
Novartis
US Patent
LigandPNGBDBM251493(US9452998, 42)
Affinity DataIC50:  2.70nMpH: 7.4Assay Description:The compounds of formula I were tested for their activity on different PKC isoforms according to a published method (D. Geiges et al. Biochem. Pharma...
Ligand InfoPC cidPC sid
In DepthDetails US Patent
TargetProtein kinase C alpha type(Homo sapiens (Human))
Novartis
US Patent
LigandPNGBDBM251493(US9452998, 42)
Affinity DataIC50:  0.170nMpH: 7.4Assay Description:The compounds of formula I were tested for their activity on different PKC isoforms according to a published method (D. Geiges et al. Biochem. Pharma...
Ligand InfoPC cidPC sid
In DepthDetails US Patent