BDBM251505 US9452998, 54
SMILES N[C@@H]1CCN(C[C@@H]1F)c1cccnc1NC(=O)c1nc(cnc1N)-c1ncccc1OC(F)(F)F
InChI Key InChIKey=SUKUYCBPKLCSMU-NWDGAFQWSA-N
Data  2 IC50
  Tab Delimited (TSV)   2D SDfile   Computed 3D by Vconf -m prep SDfile
Find this compound or compounds like it in BindingDB:
Activity Spreadsheet -- Enzyme Inhibition Constant Data from BindingDB
Found 2 hits for monomerid = 251505
TargetProtein kinase C theta type(Homo sapiens (Human))
Novartis
US Patent
LigandPNGBDBM251505(US9452998, 54)
Affinity DataIC50:  1.20nMpH: 7.4Assay Description:The compounds of formula I were tested for their activity on different PKC isoforms according to a published method (D. Geiges et al. Biochem. Pharma...
Ligand InfoPC cidPC sid
In DepthDetails US Patent
TargetProtein kinase C alpha type(Homo sapiens (Human))
Novartis
US Patent
LigandPNGBDBM251505(US9452998, 54)
Affinity DataIC50:  0.25nMpH: 7.4Assay Description:The compounds of formula I were tested for their activity on different PKC isoforms according to a published method (D. Geiges et al. Biochem. Pharma...
Ligand InfoPC cidPC sid
In DepthDetails US Patent