BDBM251512 US9452998, 61
SMILES Cn1ccc2c(cccc12)-c1cnc(N)c(n1)C(=O)Nc1ncccc1N1CCC(N)CC1
InChI Key InChIKey=LEFJXBZIODMDQB-UHFFFAOYSA-N
Data  2 IC50
  Tab Delimited (TSV)   2D SDfile   Computed 3D by Vconf -m prep SDfile
Find this compound or compounds like it in BindingDB:
Activity Spreadsheet -- Enzyme Inhibition Constant Data from BindingDB
Found 2 hits for monomerid = 251512
TargetProtein kinase C theta type(Homo sapiens (Human))
Novartis
US Patent
LigandPNGBDBM251512(US9452998, 61)
Affinity DataIC50:  0.680nMpH: 7.4Assay Description:The compounds of formula I were tested for their activity on different PKC isoforms according to a published method (D. Geiges et al. Biochem. Pharma...
Ligand InfoPC cidPC sid
In DepthDetails US Patent
TargetProtein kinase C alpha type(Homo sapiens (Human))
Novartis
US Patent
LigandPNGBDBM251512(US9452998, 61)
Affinity DataIC50:  0.130nMpH: 7.4Assay Description:The compounds of formula I were tested for their activity on different PKC isoforms according to a published method (D. Geiges et al. Biochem. Pharma...
Ligand InfoPC cidPC sid
In DepthDetails US Patent