BDBM251689 US10100018, Example 25::US9464060, 25
SMILES Cc1ccccc1Oc1ccc(cc1)C(=O)N(CCc1ccccc1)Cc1ccc(cc1)C(O)=O
InChI Key InChIKey=FRPHXCIHOZPOPE-UHFFFAOYSA-N
Data  4 IC50
  Tab Delimited (TSV)   2D SDfile   Computed 3D by Vconf -m prep SDfile
Find this compound or compounds like it in BindingDB:
Activity Spreadsheet -- Enzyme Inhibition Constant Data from BindingDB
Found 4 hits for monomerid = 251689
TargetLysophosphatidic acid receptor 5(Homo sapiens (Human))
Takeda Pharmaceutical
US Patent
LigandPNGBDBM251689(US10100018, Example 25 | US9464060, 25)
Affinity DataIC50:  29nMT: 2°C. Assay description: Engagement of the LPA5 receptor by its ligand, oleoyl-L-α-lysophosphatidic acid (LPA), leads to the release of intracellular stores of calcium into ...
Ligand InfoPC cidPC sid
In DepthDetails US Patent
TargetLysophosphatidic acid receptor 1(Homo sapiens (Human))
Takeda Pharmaceutical
US Patent
LigandPNGBDBM251689(US10100018, Example 25 | US9464060, 25)
Affinity DataIC50:  29nMT: 2°C. Assay description: Engagement of the LPA1 receptor by its ligand, oleoyl-L-α-lysophosphatidic acid (LPA), leads to the release of intracellular stores of calcium i...
Ligand InfoPC cidPC sid
In DepthDetails US Patent
TargetLysophosphatidic acid receptor 1(Homo sapiens (Human))
Takeda Pharmaceutical
US Patent
LigandPNGBDBM251689(US10100018, Example 25 | US9464060, 25)
Affinity DataIC50:  14nMT: 2°C. Assay description: Engagement of the LPA1 receptor by its ligand, oleoyl-L-α-lysophosphatidic acid (LPA), leads to the release of intracellular stores of calcium i...
Ligand InfoPC cidPC sid
In DepthDetails US Patent
TargetLysophosphatidic acid receptor 1(Homo sapiens (Human))
Takeda Pharmaceutical
US Patent
LigandPNGBDBM251689(US10100018, Example 25 | US9464060, 25)
Affinity DataIC50:  14nMT: 2°C. Assay description: Engagement of the LPA1 receptor by its ligand, oleoyl-L-α-lysophosphatidic acid (LPA), leads to the release of intracellular stores of calcium into ...
Ligand InfoPC cidPC sid
In DepthDetails US Patent