BDBM251809 US9469653, 5-58
SMILES C(Nc1ccc2nc(sc2n1)-c1ccccc1)c1ccccc1
InChI Key InChIKey=BKMGBWLILWZAPT-UHFFFAOYSA-N
Data  1 IC50
  Tab Delimited (TSV)   2D SDfile   Computed 3D by Vconf -m prep SDfile
Find this compound or compounds like it in BindingDB:
Activity Spreadsheet -- Enzyme Inhibition Constant Data from BindingDB
Found 1 hit for monomerid = 251809
TargetAmine oxidase [flavin-containing] B(Homo sapiens (Human))
Korea Institute Of Science And Technology
US Patent
LigandPNGBDBM251809(US9469653, 5-58)
Affinity DataIC50:  1.90E+6nM. Assay description: A stock solution was prepared using a human MAO-B enzyme (purchased from Aldrich) and a Amplex Red monoamine oxidase assay kit according to a prepara...
Ligand InfoPC cidPC sid
In DepthDetails US Patent