BDBM251816 US9469653, 5-77
SMILES CNc1ccc2nc(oc2n1)-c1ccc(Cl)cc1
InChI Key InChIKey=NLYZVMDHEWMMFC-UHFFFAOYSA-N
Data  1 IC50
  Tab Delimited (TSV)   2D SDfile   Computed 3D by Vconf -m prep SDfile
Find this compound or compounds like it in BindingDB:
Activity Spreadsheet -- Enzyme Inhibition Constant Data from BindingDB
Found 1 hit for monomerid = 251816
TargetAmine oxidase [flavin-containing] B(Homo sapiens (Human))
Korea Institute Of Science And Technology
US Patent
LigandPNGBDBM251816(US9469653, 5-77)
Affinity DataIC50:  3.02E+3nM. Assay description: A stock solution was prepared using a human MAO-B enzyme (purchased from Aldrich) and a Amplex Red monoamine oxidase assay kit according to a prepara...
Ligand InfoPC cidPC sid
In DepthDetails US Patent