BDBM251838 US9475779, D.3.3
SMILES CN1C(C2=C(CCC2=O)N(C1=O)c1cncc(Br)c1)c1ccc(cc1S(C)(=O)=O)C#N
InChI Key InChIKey=OSYWDUVOZOZUMD-UHFFFAOYSA-N
Data  1 IC50
  Tab Delimited (TSV)   2D SDfile   Computed 3D by Vconf -m prep SDfile
Find this compound or compounds like it in BindingDB:
Activity Spreadsheet -- Enzyme Inhibition Constant Data from BindingDB
Found 1 hit for monomerid = 251838
TargetNeutrophil elastase(Homo sapiens (Human))
Boehringer Ingelheim International
US Patent
LigandPNGBDBM251838(US9475779, D.3.3)
Affinity DataIC50:  13nMpH: 7.5 T: 2°C. Assay description: The following buffers were used: Compound buffer: 100 mM Tris, 500 mM NaCl, adjusted to pH 7.5; Assay buffer: 100 mM Tris, 500 mM NaCl, adjusted to p...
Ligand InfoPC cidPC sid
In DepthDetails US Patent