BDBM251871 US9475806, 6-C b) (+)
SMILES COc1cc(C)c2[nH]ccc2c1C(O)c1nc2ncc(cc2[nH]1)C#N
InChI Key
Data  1 IC50
  Tab Delimited (TSV)   2D SDfile   Computed 3D by Vconf -m prep SDfile
Find this compound or compounds like it in BindingDB:
Activity Spreadsheet -- Enzyme Inhibition Constant Data from BindingDB
Found 1 hit for monomerid = 251871
TargetComplement factor B(Homo sapiens (Human))
Novartis
US Patent
LigandPNGBDBM251871(US9475806, 6-C b) (+))
Affinity DataIC50:  700nMpH: 7.4 T: 2°C. Assay description: Recombinant human factor B (expressed in drosophila cells and purified using standard methods) labeled with biotin (10 nM), europium-labeled streptav...
Ligand InfoPC cidPC sid
In DepthDetails US Patent