BDBM252255 US9458113, 1.10
SMILES CN1C(C2=C(CCC2=O)N(C1=O)c1cccc(c1)C(F)(F)F)c1ccc(cc1C(=O)N1CCCC1)C#N
InChI Key InChIKey=HARYGZRMMYBNCC-UHFFFAOYSA-N
Data  1 IC50
  Tab Delimited (TSV)   2D SDfile   Computed 3D by Vconf -m prep SDfile
Find this compound or compounds like it in BindingDB:
Activity Spreadsheet -- Enzyme Inhibition Constant Data from BindingDB
Found 1 hit for monomerid = 252255
TargetNeutrophil elastase(Homo sapiens (Human))
Boehringer Ingelheim International
US Patent
LigandPNGBDBM252255(US9458113, 1.10)
Affinity DataIC50:  3.40nMpH: 7.5 T: 2°C. Assay description: The following buffers were used: Compound buffer: 100 mM Tris, 500 mM NaCl, adjusted to pH 7.5; Assay buffer: 100 mM Tris, 500 mM NaCl, adjusted to p...
Ligand InfoPC cidPC sid
In DepthDetails US Patent